Reaction Details
TargetHistone deacetylase 2b
LigandBDBM50115653
Substrate/Competitorn/a
Meas. Tech.ChEMBL_87850 (CHEMBL701990)
IC50 40±n/a nM
Citation Wittich, SScherf, HXie, CBrosch, GLoidl, PGerhäuser, CJung, M Structure-activity relationships on phenylalanine-containing inhibitors of histone deacetylase: in vitro enzyme inhibition, induction of differentiation, and inhibition of proliferation in Friend leukemic cells. J Med Chem45:3296-309 (2002) Histone deacetylase 2b
Name:Histone deacetylase 2b
Synonyms:Histone deacetylase HD2
Type:PROTEIN
Mol. Mass.:30785.07
Organism:Zea mays
Description:ChEMBL_87549
Residue:286
BDBM50115653
NameBDBM50115653
TypeSmall organic molecule
Emp. Form.C24H31N3O4
Mol. Mass.425.5206
SMILESONC(=O)CCCCCCC(=O)N[C@@H](Cc1ccccc1)C(=O)NCc1ccccc1