Reaction Details
TargetThyroid hormone receptor alpha
LigandBDBM50115667
Substrate/Competitorn/a
Meas. Tech.ChEMBL_210491 (CHEMBL814598)
Kd 490±n/a nM
Citation Nguyen, NHApriletti, JWCunha Lima, STWebb, PBaxter, JDScanlan, TS Rational design and synthesis of a novel thyroid hormone antagonist that blocks coactivator recruitment. J Med Chem45:3310-20 (2002) Thyroid hormone receptor alpha
Name:Thyroid hormone receptor alpha
Type:Receptor
Mol. Mass.:54818.00
Organism:Homo sapiens (Human)
Description:Recombinant hThR was obtained from nuclear extracts from SF9 cells infected with baculovirus vectors encoding for ThRalpha 1.
Residue:490
BDBM50115667
NameBDBM50115667
Synonyms:CHEMBL111953 | [4-(4-Hydroxy-3-isopropyl-5-phenylethynyl-benzyl)-3,5-dimethyl-phenoxy]-acetic acid(NH-1)
TypeSmall organic molecule
Emp. Form.C28H28O4
Mol. Mass.428.5195
SMILESCC(C)c1cc(Cc2c(C)cc(OCC(O)=O)cc2C)cc(C#Cc2ccccc2)c1O