Reaction Details
TargetThyroid hormone receptor beta
LigandBDBM50115666
Substrate/Competitorn/a
Meas. Tech.ChEMBL_210502 (CHEMBL811897)
Kd 0.52±n/a nM
Citation Nguyen, NHApriletti, JWCunha Lima, STWebb, PBaxter, JDScanlan, TS Rational design and synthesis of a novel thyroid hormone antagonist that blocks coactivator recruitment. J Med Chem45:3310-20 (2002) Thyroid hormone receptor beta
Name:Thyroid hormone receptor beta
Type:Receptor
Mol. Mass.:52793.62
Organism:Homo sapiens (Human)
Description:Recombinant hThR was obtained from nuclear extracts from SF9 cells infected with baculovirus vectors encoding for ThRbeta 1.
Residue:461
BDBM50115666
NameBDBM50115666
Synonyms:CHEMBL109430 | {4-[4-Hydroxy-3-isopropyl-5-(4-pentyl-phenylethynyl)-benzyl]-3,5-dimethyl-phenoxy}-acetic acid(NH-2)
TypeSmall organic molecule
Emp. Form.C33H38O4
Mol. Mass.498.6524
SMILESCCCCCc1ccc(cc1)C#Cc1cc(Cc2c(C)cc(OCC(O)=O)cc2C)cc(C(C)C)c1O