Reaction Details
TargetThyroid hormone receptor beta
LigandBDBM50115667
Substrate/Competitorn/a
Meas. Tech.ChEMBL_210502 (CHEMBL811897)
Kd 37±n/a nM
Citation Nguyen, NHApriletti, JWCunha Lima, STWebb, PBaxter, JDScanlan, TS Rational design and synthesis of a novel thyroid hormone antagonist that blocks coactivator recruitment. J Med Chem45:3310-20 (2002) Thyroid hormone receptor beta
Name:Thyroid hormone receptor beta
Type:Receptor
Mol. Mass.:52793.62
Organism:Homo sapiens (Human)
Description:Recombinant hThR was obtained from nuclear extracts from SF9 cells infected with baculovirus vectors encoding for ThRbeta 1.
Residue:461
BDBM50115667
NameBDBM50115667
Synonyms:CHEMBL111953 | [4-(4-Hydroxy-3-isopropyl-5-phenylethynyl-benzyl)-3,5-dimethyl-phenoxy]-acetic acid(NH-1)
TypeSmall organic molecule
Emp. Form.C28H28O4
Mol. Mass.428.5195
SMILESCC(C)c1cc(Cc2c(C)cc(OCC(O)=O)cc2C)cc(C#Cc2ccccc2)c1O