Reaction Details
TargetTissue-type plasminogen activator
LigandBDBM14156
Substrate/Competitorn/a
Meas. Tech.ChEBML_208244
Ki 360±n/a nM
Citation Spencer, JRMcGee, DAllen, DKatz, BALuong, CSendzik, MSquires, NMackman, RL 4-Aminoarylguanidine and 4-aminobenzamidine derivatives as potent and selective urokinase-type plasminogen activator inhibitors. Bioorg Med Chem Lett12:2023-6 (2002) Tissue-type plasminogen activator
Name:Tissue-type plasminogen activator
Type:Enzyme
Mol. Mass.:62931.08
Organism:Homo sapiens (Human)
Description:n/a
Residue:562
BDBM14156
NameBDBM14156
Synonyms:3-bromo-N-(4-carbamimidoylphenyl)-2-hydroxy-5-methylbenzamide CHEMBL61327
TypeSmall organic molecule
Emp. Form.C15H14BrN3O2
Mol. Mass.348.195
SMILESCc1cc(Br)c(O)c(c1)C(=O)Nc1ccc(cc1)C(N)=N