Reaction Details
TargetHistone deacetylase 6
LigandBDBM50555461
Substrate/Competitorn/a
Meas. Tech.ChEMBL_2052264 (CHEMBL4707265)
EC50 190±n/a nM
Citation Chen, DSoh, CKGoh, WHWang, H Design, Synthesis, and Preclinical Evaluation of Fused Pyrimidine-Based Hydroxamates for the Treatment of Hepatocellular Carcinoma. J Med Chem61:1552-1575 (2018) 
 
Histone deacetylase 6
Name:Histone deacetylase 6
Type:Chromatin regulator; hydrolase; repressor
Mol. Mass.:131381.51
Organism:Homo sapiens (Human)
Description:Q9UBN7
Residue:1215
BDBM50555461
NameBDBM50555461
Synonyms:CHEMBL4749655
TypeSmall organic molecule
Emp. Form.C23H30N6O4
Mol. Mass.454.5221
SMILESOCc1cccc(c1)-c1nc(N2CCOCC2)c2ncn(CCCCCCC(=O)NO)c2n1