Reaction Details
TargetAlpha-1D adrenergic receptor
LigandBDBM50116203
Substrate/Competitorn/a
Meas. Tech.ChEBML_32433
Ki 23±n/a nM
Citation Khatuya, HPulito, VLJolliffe, LKLi, XMurray, WV Novel thiophene derivatives for the treatment of benign prostatic hyperplasia. Bioorg Med Chem Lett12:2145-8 (2002) Alpha-1D adrenergic receptor
Name:Alpha-1D adrenergic receptor
Type:Enzyme Catalytic Domain
Mol. Mass.:60485.82
Organism:Homo sapiens (Human)
Description:adrenergic Alpha1D ADRA1D HUMAN::P25100
Residue:572
BDBM50116203
NameBDBM50116203
Synonyms:1-{5-[4-(2-Methoxy-phenyl)-piperazin-1-ylmethyl]-thiophen-2-ylmethyl}-pyrrolidin-2-one | CHEMBL70178
TypeSmall organic molecule
Emp. Form.C21H27N3O2S
Mol. Mass.385.523
SMILESCOc1ccccc1N1CCN(Cc2ccc(CN3CCCC3=O)s2)CC1