Reaction Details
TargetAlpha-1A adrenergic receptor
LigandBDBM50116201
Substrate/Competitorn/a
Meas. Tech.ChEBML_33608
Ki 202±n/a nM
Citation Khatuya, HPulito, VLJolliffe, LKLi, XMurray, WV Novel thiophene derivatives for the treatment of benign prostatic hyperplasia. Bioorg Med Chem Lett12:2145-8 (2002) Alpha-1A adrenergic receptor
Name:Alpha-1A adrenergic receptor
Type:Cell-surface receptors
Mol. Mass.:51511.67
Organism:Homo sapiens (Human)
Description:P35348
Residue:466
BDBM50116201
NameBDBM50116201
Synonyms:CHEMBL302495 | {5-[4-(2-Methoxy-phenyl)-piperazin-1-ylmethyl]-thiophen-2-yl}-methanol
TypeSmall organic molecule
Emp. Form.C17H22N2O2S
Mol. Mass.318.434
SMILESCOc1ccccc1N1CCN(Cc2ccc(CO)s2)CC1