Reaction Details
TargetAlpha-1D adrenergic receptor
LigandBDBM50116202
Substrate/Competitorn/a
Meas. Tech.ChEBML_32433
Ki 130±n/a nM
Citation Khatuya, HPulito, VLJolliffe, LKLi, XMurray, WV Novel thiophene derivatives for the treatment of benign prostatic hyperplasia. Bioorg Med Chem Lett12:2145-8 (2002) Alpha-1D adrenergic receptor
Name:Alpha-1D adrenergic receptor
Type:Enzyme Catalytic Domain
Mol. Mass.:60485.82
Organism:Homo sapiens (Human)
Description:adrenergic Alpha1D ADRA1D HUMAN::P25100
Residue:572
BDBM50116202
NameBDBM50116202
Synonyms:1-{5-[4-(2-Methoxy-phenyl)-piperazin-1-ylmethyl]-thiophen-2-ylmethyl}-piperidin-2-ol | CHEMBL66823
TypeSmall organic molecule
Emp. Form.C22H31N3O2S
Mol. Mass.401.565
SMILESCOc1ccccc1N1CCN(Cc2ccc(CN3CCCCC3O)s2)CC1