Reaction Details
TargetAlpha-1B adrenergic receptor
LigandBDBM50116203
Substrate/Competitorn/a
Meas. Tech.ChEBML_34331
Ki>5000±n/a nM
Citation Khatuya, HPulito, VLJolliffe, LKLi, XMurray, WV Novel thiophene derivatives for the treatment of benign prostatic hyperplasia. Bioorg Med Chem Lett12:2145-8 (2002) Alpha-1B adrenergic receptor
Name:Alpha-1B adrenergic receptor
Type:Enzyme
Mol. Mass.:56862.13
Organism:Homo sapiens (Human)
Description:P35368
Residue:520
BDBM50116203
NameBDBM50116203
Synonyms:1-{5-[4-(2-Methoxy-phenyl)-piperazin-1-ylmethyl]-thiophen-2-ylmethyl}-pyrrolidin-2-one | CHEMBL70178
TypeSmall organic molecule
Emp. Form.C21H27N3O2S
Mol. Mass.385.523
SMILESCOc1ccccc1N1CCN(Cc2ccc(CN3CCCC3=O)s2)CC1