Reaction Details
TargetAlpha-1D adrenergic receptor
LigandBDBM50116200
Substrate/Competitorn/a
Meas. Tech.ChEBML_32433
Ki 339±n/a nM
Citation Khatuya, HPulito, VLJolliffe, LKLi, XMurray, WV Novel thiophene derivatives for the treatment of benign prostatic hyperplasia. Bioorg Med Chem Lett12:2145-8 (2002) Alpha-1D adrenergic receptor
Name:Alpha-1D adrenergic receptor
Type:Enzyme Catalytic Domain
Mol. Mass.:60485.82
Organism:Homo sapiens (Human)
Description:adrenergic Alpha1D ADRA1D HUMAN::P25100
Residue:572
BDBM50116200
NameBDBM50116200
Synonyms:CHEMBL303485 | {5-[4-(2-Propoxy-phenyl)-piperazin-1-ylmethyl]-thiophen-3-yl}-methanol
TypeSmall organic molecule
Emp. Form.C19H26N2O2S
Mol. Mass.346.487
SMILESCC(C)Oc1ccccc1N1CCN(Cc2cc(CO)cs2)CC1