Reaction Details
TargetIntegrin alpha-4/beta-1
LigandBDBM50116286
Substrate/Competitorn/a
Meas. Tech.ChEMBL_215740 (CHEMBL823096)
IC50 0.340000±n/a nM
Citation Kamenecka, TMLanza, Tde Laszlo, SELi, BMcCauley, EDVan Riper, GEgger, LAKidambi, UMumford, RATong, SMacCoss, MSchmidt, JAHagmann, WK N-aryl-prolyl-dipeptides as potent antagonists of VLA-4. Bioorg Med Chem Lett12:2205-8 (2002) Integrin alpha-4/beta-1
Name:Integrin alpha-4/beta-1
Type:n/a
Mol. Mass.:n/a
Description:ASSAY_ID of EBI is 88912
Components:This complex has 2 components.
Component 1
Name:Integrin beta-1
Synonyms:CD_antigen=CD29 Fibronectin receptor beta GPIIA ITGB1 MDF2 | MSK12
Type:Enzyme
Mol. Mass.:88400.38
Organism:Homo sapiens (Human)
Description:P05556
Residue:798
Component 2
Name:Integrin alpha-4
Synonyms:CD49 antigen-like family member D CD49d antigen ITA4_HUMAN Integrin alpha-4 Integrin alpha-IV VLA-4 integrin alpha 4 precursor | integrin alpha-4 precursor
Type:Membrane Protein
Mol. Mass.:114897.35
Organism:Homo sapiens (Human)
Description:P13612
Residue:1032
BDBM50116286
NameBDBM50116286
Synonyms:(S)-3-(2',6'-Dimethoxy-biphenyl-4-yl)-2-[((S)-1-pyridin-3-yl-pyrrolidine-2-carbonyl)-amino]-propionic acid | CHEMBL69352
TypeSmall organic molecule
Emp. Form.C27H29N3O5
Mol. Mass.475.5363
SMILESCOc1cccc(OC)c1-c1ccc(C[C@H](NC(=O)[C@@H]2CCCN2c2cccnc2)C(O)=O)cc1