Reaction Details
TargetNeuromedin-K receptor
LigandBDBM50116718
Substrate/Competitorn/a
Meas. Tech.ChEBML_209564
Ki 97±n/a nM
Citation Reichard, GAGrice, CAShih, NYSpitler, JMajmundar, SWang, SDPaliwal, SAnthes, JCPiwinski, JJ Preparation of oxime dual NK(1)/NK(2) antagonists with reduced NK(3) affinity. Bioorg Med Chem Lett12:2355-8 (2002) Neuromedin-K receptor
Name:Neuromedin-K receptor
Type:Enzyme
Mol. Mass.:52221.96
Organism:Homo sapiens (Human)
Description:P29371
Residue:465
BDBM50116718
NameBDBM50116718
Synonyms:3,5-Dichloro-N-{(R)-3-(3,4-dichloro-phenyl)-2-[(Z)-methoxyimino]-5-[4-(2-oxo-2,3-dihydro-benzoimidazol-1-yl)-piperidin-1-yl]-pentyl}-N-ethyl-benzamide | CHEMBL306624
TypeSmall organic molecule
Emp. Form.C33H35Cl4N5O3
Mol. Mass.691.475
SMILESCCN(C\C(=N/OC)[C@H](CCN1CCC(CC1)n1c2ccccc2[nH]c1=O)c1ccc(Cl)c(Cl)c1)C(=O)c1cc(Cl)cc(Cl)c1