Reaction Details
TargetSubstance-P receptor
LigandBDBM50116731
Substrate/Competitorn/a
Meas. Tech.ChEBML_205873
Ki 0.700000±n/a nM
Citation Reichard, GAGrice, CAShih, NYSpitler, JMajmundar, SWang, SDPaliwal, SAnthes, JCPiwinski, JJ Preparation of oxime dual NK(1)/NK(2) antagonists with reduced NK(3) affinity. Bioorg Med Chem Lett12:2355-8 (2002) Substance-P receptor
Name:Substance-P receptor
Type:G Protein-Coupled Receptor (GPCR)
Mol. Mass.:46254.43
Organism:Homo sapiens (Human)
Description:P25103
Residue:407
BDBM50116731
NameBDBM50116731
Synonyms:3,5-Dichloro-N-{(R)-3-(3,4-dichloro-phenyl)-2-[(Z)-methoxyimino]-5-[4-(2-oxo-3-pyridin-2-ylmethyl-tetrahydro-pyrimidin-1-yl)-piperidin-1-yl]-pentyl}-N-methyl-benzamide | CHEMBL76580
TypeSmall organic molecule
Emp. Form.C35H40Cl4N6O3
Mol. Mass.734.543
SMILESCO\N=C(/CN(C)C(=O)c1cc(Cl)cc(Cl)c1)[C@H](CCN1CCC(CC1)N1CCCN(Cc2ccccn2)C1=O)c1ccc(Cl)c(Cl)c1