Reaction Details
TargetSubstance-P receptor
LigandBDBM50116724
Substrate/Competitorn/a
Meas. Tech.ChEBML_205873
Ki 3.2±n/a nM
Citation Reichard, GAGrice, CAShih, NYSpitler, JMajmundar, SWang, SDPaliwal, SAnthes, JCPiwinski, JJ Preparation of oxime dual NK(1)/NK(2) antagonists with reduced NK(3) affinity. Bioorg Med Chem Lett12:2355-8 (2002) Substance-P receptor
Name:Substance-P receptor
Type:G Protein-Coupled Receptor (GPCR)
Mol. Mass.:46254.43
Organism:Homo sapiens (Human)
Description:P25103
Residue:407
BDBM50116724
NameBDBM50116724
Synonyms:3,5-Dichloro-N-{(R)-3-(3,4-dichloro-phenyl)-2-[(Z)-methoxyimino]-5-[4-(2-oxo-2,3-dihydro-benzoimidazol-1-yl)-piperidin-1-yl]-pentyl}-N-(2-fluoro-ethyl)-benzamide | CHEMBL308983
TypeSmall organic molecule
Emp. Form.C33H34Cl4FN5O3
Mol. Mass.709.465
SMILESCO\N=C(/CN(CCF)C(=O)c1cc(Cl)cc(Cl)c1)[C@H](CCN1CCC(CC1)n1c2ccccc2[nH]c1=O)c1ccc(Cl)c(Cl)c1