Reaction Details
TargetSubstance-K receptor
LigandBDBM50116720
Substrate/Competitorn/a
Meas. Tech.ChEBML_209036
Ki 1.7±n/a nM
Citation Reichard, GAGrice, CAShih, NYSpitler, JMajmundar, SWang, SDPaliwal, SAnthes, JCPiwinski, JJ Preparation of oxime dual NK(1)/NK(2) antagonists with reduced NK(3) affinity. Bioorg Med Chem Lett12:2355-8 (2002) Substance-K receptor
Name:Substance-K receptor
Type:Protein
Mol. Mass.:44455.78
Organism:Homo sapiens (Human)
Description:P21452
Residue:398
BDBM50116720
NameBDBM50116720
Synonyms:CHEMBL77042 | [3-(1-{(R)-5-[(3,5-Dichloro-benzoyl)-methyl-amino]-3-(3,4-dichloro-phenyl)-4-[(Z)-methoxyimino]-pentyl}-piperidin-4-yl)-2-oxo-2,3-dihydro-benzoimidazol-1-yl]-acetic acid
TypeSmall organic molecule
Emp. Form.C34H35Cl4N5O5
Mol. Mass.735.484
SMILESCO\N=C(/CN(C)C(=O)c1cc(Cl)cc(Cl)c1)[C@H](CCN1CCC(CC1)n1c2ccccc2n(CC(O)=O)c1=O)c1ccc(Cl)c(Cl)c1