Reaction Details
TargetNeuromedin-K receptor
LigandBDBM50116738
Substrate/Competitorn/a
Meas. Tech.ChEBML_209564
Ki 176±n/a nM
Citation Reichard, GAGrice, CAShih, NYSpitler, JMajmundar, SWang, SDPaliwal, SAnthes, JCPiwinski, JJ Preparation of oxime dual NK(1)/NK(2) antagonists with reduced NK(3) affinity. Bioorg Med Chem Lett12:2355-8 (2002) Neuromedin-K receptor
Name:Neuromedin-K receptor
Type:Enzyme
Mol. Mass.:52221.96
Organism:Homo sapiens (Human)
Description:P29371
Residue:465
BDBM50116738
NameBDBM50116738
Synonyms:CHEMBL307877 | [3-(1-{(R)-5-[(3,5-Dichloro-benzoyl)-ethyl-amino]-3-(3,4-dichloro-phenyl)-4-[(Z)-methoxyimino]-pentyl}-piperidin-4-yl)-2-oxo-2,3-dihydro-benzoimidazol-1-yl]-acetic acid
TypeSmall organic molecule
Emp. Form.C35H37Cl4N5O5
Mol. Mass.749.511
SMILESCCN(C\C(=N/OC)[C@H](CCN1CCC(CC1)n1c2ccccc2n(CC(O)=O)c1=O)c1ccc(Cl)c(Cl)c1)C(=O)c1cc(Cl)cc(Cl)c1