Reaction Details
TargetSubstance-P receptor
LigandBDBM50116741
Substrate/Competitorn/a
Meas. Tech.ChEBML_205873
Ki 2±n/a nM
Citation Reichard, GAGrice, CAShih, NYSpitler, JMajmundar, SWang, SDPaliwal, SAnthes, JCPiwinski, JJ Preparation of oxime dual NK(1)/NK(2) antagonists with reduced NK(3) affinity. Bioorg Med Chem Lett12:2355-8 (2002) Substance-P receptor
Name:Substance-P receptor
Type:G Protein-Coupled Receptor (GPCR)
Mol. Mass.:46254.43
Organism:Homo sapiens (Human)
Description:P25103
Residue:407
BDBM50116741
NameBDBM50116741
Synonyms:3,5-Dichloro-N-{(R)-3-(3,4-dichloro-phenyl)-5-{4-[3-(2-methoxy-ethyl)-2-oxo-2,3-dihydro-benzoimidazol-1-yl]-piperidin-1-yl}-2-[(Z)-methoxyimino]-pentyl}-N-ethyl-benzamide | CHEMBL306124
TypeSmall organic molecule
Emp. Form.C36H41Cl4N5O4
Mol. Mass.749.554
SMILESCCN(C\C(=N/OC)[C@H](CCN1CCC(CC1)n1c2ccccc2n(CCOC)c1=O)c1ccc(Cl)c(Cl)c1)C(=O)c1cc(Cl)cc(Cl)c1