Reaction Details
TargetSubstance-K receptor
LigandBDBM50116716
Substrate/Competitorn/a
Meas. Tech.ChEBML_209036
Ki 2.5±n/a nM
Citation Reichard, GAGrice, CAShih, NYSpitler, JMajmundar, SWang, SDPaliwal, SAnthes, JCPiwinski, JJ Preparation of oxime dual NK(1)/NK(2) antagonists with reduced NK(3) affinity. Bioorg Med Chem Lett12:2355-8 (2002) Substance-K receptor
Name:Substance-K receptor
Type:Protein
Mol. Mass.:44455.78
Organism:Homo sapiens (Human)
Description:P21452
Residue:398
BDBM50116716
NameBDBM50116716
Synonyms:3,5-Dichloro-N-cyclopropyl-N-{(R)-3-(3,4-dichloro-phenyl)-2-[(Z)-methoxyimino]-5-[4-(2-oxo-2,3-dihydro-benzoimidazol-1-yl)-piperidin-1-yl]-pentyl}-benzamide | CHEMBL312141
TypeSmall organic molecule
Emp. Form.C34H35Cl4N5O3
Mol. Mass.703.485
SMILESCO\N=C(/CN(C1CC1)C(=O)c1cc(Cl)cc(Cl)c1)[C@H](CCN1CCC(CC1)n1c2ccccc2[nH]c1=O)c1ccc(Cl)c(Cl)c1