Reaction Details
TargetSubstance-K receptor
LigandBDBM50116725
Substrate/Competitorn/a
Meas. Tech.ChEBML_209036
Ki 1.2±n/a nM
Citation Reichard, GAGrice, CAShih, NYSpitler, JMajmundar, SWang, SDPaliwal, SAnthes, JCPiwinski, JJ Preparation of oxime dual NK(1)/NK(2) antagonists with reduced NK(3) affinity. Bioorg Med Chem Lett12:2355-8 (2002) Substance-K receptor
Name:Substance-K receptor
Type:Protein
Mol. Mass.:44455.78
Organism:Homo sapiens (Human)
Description:P21452
Residue:398
BDBM50116725
NameBDBM50116725
Synonyms:3,5-Dichloro-N-{(R)-3-(3,4-dichloro-phenyl)-2-[(Z)-methoxyimino]-5-[4-(3-methylcarbamoylmethyl-2-oxo-tetrahydro-pyrimidin-1-yl)-piperidin-1-yl]-pentyl}-N-methyl-benzamide | CHEMBL310334
TypeSmall organic molecule
Emp. Form.C32H40Cl4N6O4
Mol. Mass.714.51
SMILESCNC(=O)CN1CCCN(C2CCN(CC[C@@H](\C(CN(C)C(=O)c3cc(Cl)cc(Cl)c3)=N\OC)c3ccc(Cl)c(Cl)c3)CC2)C1=O