Reaction Details
TargetSubstance-P receptor
LigandBDBM50116745
Substrate/Competitorn/a
Meas. Tech.ChEBML_205873
Ki 0.300000±n/a nM
Citation Reichard, GAGrice, CAShih, NYSpitler, JMajmundar, SWang, SDPaliwal, SAnthes, JCPiwinski, JJ Preparation of oxime dual NK(1)/NK(2) antagonists with reduced NK(3) affinity. Bioorg Med Chem Lett12:2355-8 (2002) Substance-P receptor
Name:Substance-P receptor
Type:G Protein-Coupled Receptor (GPCR)
Mol. Mass.:46254.43
Organism:Homo sapiens (Human)
Description:P25103
Residue:407
BDBM50116745
NameBDBM50116745
Synonyms:CHEMBL78284 | N-{(R)-5-[4-(3-Carbamoylmethyl-2-oxo-tetrahydro-pyrimidin-1-yl)-piperidin-1-yl]-3-(3,4-dichloro-phenyl)-2-[(Z)-methoxyimino]-pentyl}-3,5-dichloro-N-methyl-benzamide
TypeSmall organic molecule
Emp. Form.C31H38Cl4N6O4
Mol. Mass.700.483
SMILESCO\N=C(/CN(C)C(=O)c1cc(Cl)cc(Cl)c1)[C@H](CCN1CCC(CC1)N1CCCN(CC(N)=O)C1=O)c1ccc(Cl)c(Cl)c1