Reaction Details
TargetSubstance-P receptor
LigandBDBM50116738
Substrate/Competitorn/a
Meas. Tech.ChEBML_205873
Ki 2.4±n/a nM
Citation Reichard, GAGrice, CAShih, NYSpitler, JMajmundar, SWang, SDPaliwal, SAnthes, JCPiwinski, JJ Preparation of oxime dual NK(1)/NK(2) antagonists with reduced NK(3) affinity. Bioorg Med Chem Lett12:2355-8 (2002) Substance-P receptor
Name:Substance-P receptor
Type:G Protein-Coupled Receptor (GPCR)
Mol. Mass.:46254.43
Organism:Homo sapiens (Human)
Description:P25103
Residue:407
BDBM50116738
NameBDBM50116738
Synonyms:CHEMBL307877 | [3-(1-{(R)-5-[(3,5-Dichloro-benzoyl)-ethyl-amino]-3-(3,4-dichloro-phenyl)-4-[(Z)-methoxyimino]-pentyl}-piperidin-4-yl)-2-oxo-2,3-dihydro-benzoimidazol-1-yl]-acetic acid
TypeSmall organic molecule
Emp. Form.C35H37Cl4N5O5
Mol. Mass.749.511
SMILESCCN(C\C(=N/OC)[C@H](CCN1CCC(CC1)n1c2ccccc2n(CC(O)=O)c1=O)c1ccc(Cl)c(Cl)c1)C(=O)c1cc(Cl)cc(Cl)c1