Reaction Details
TargetNeuromedin-K receptor
LigandBDBM50116742
Substrate/Competitorn/a
Meas. Tech.ChEBML_209564
Ki 12±n/a nM
Citation Reichard, GAGrice, CAShih, NYSpitler, JMajmundar, SWang, SDPaliwal, SAnthes, JCPiwinski, JJ Preparation of oxime dual NK(1)/NK(2) antagonists with reduced NK(3) affinity. Bioorg Med Chem Lett12:2355-8 (2002) Neuromedin-K receptor
Name:Neuromedin-K receptor
Type:Enzyme
Mol. Mass.:52221.96
Organism:Homo sapiens (Human)
Description:P29371
Residue:465
BDBM50116742
NameBDBM50116742
Synonyms:CHEMBL75479 | [3-(1-{(R)-5-[(3,5-Dichloro-benzoyl)-methyl-amino]-3-(3,4-dichloro-phenyl)-4-[(Z)-methoxyimino]-pentyl}-piperidin-4-yl)-2-oxo-tetrahydro-pyrimidin-1-yl]-acetic acid benzyl ester
TypeSmall organic molecule
Emp. Form.C38H43Cl4N5O5
Mol. Mass.791.591
SMILESCO\N=C(/CN(C)C(=O)c1cc(Cl)cc(Cl)c1)[C@H](CCN1CCC(CC1)N1CCCN(CC(=O)OCc2ccccc2)C1=O)c1ccc(Cl)c(Cl)c1