Reaction Details
TargetSubstance-P receptor
LigandBDBM50116728
Substrate/Competitorn/a
Meas. Tech.ChEBML_205873
Ki 3±n/a nM
Citation Reichard, GAGrice, CAShih, NYSpitler, JMajmundar, SWang, SDPaliwal, SAnthes, JCPiwinski, JJ Preparation of oxime dual NK(1)/NK(2) antagonists with reduced NK(3) affinity. Bioorg Med Chem Lett12:2355-8 (2002) Substance-P receptor
Name:Substance-P receptor
Type:G Protein-Coupled Receptor (GPCR)
Mol. Mass.:46254.43
Organism:Homo sapiens (Human)
Description:P25103
Residue:407
BDBM50116728
NameBDBM50116728
Synonyms:3,5-Dichloro-N-{(R)-3-(3,4-dichloro-phenyl)-5-[4-(3-ethylcarbamoylmethyl-2-oxo-2,3-dihydro-benzoimidazol-1-yl)-piperidin-1-yl]-2-[(Z)-methoxyimino]-pentyl}-N-ethyl-benzamide | CHEMBL430609
TypeSmall organic molecule
Emp. Form.C37H42Cl4N6O4
Mol. Mass.776.579
SMILESCCNC(=O)Cn1c2ccccc2n(C2CCN(CC[C@@H](\C(CN(CC)C(=O)c3cc(Cl)cc(Cl)c3)=N\OC)c3ccc(Cl)c(Cl)c3)CC2)c1=O