Reaction Details
TargetSubstance-K receptor
LigandBDBM50116719
Substrate/Competitorn/a
Meas. Tech.ChEBML_209036
Ki 1.5±n/a nM
Citation Reichard, GAGrice, CAShih, NYSpitler, JMajmundar, SWang, SDPaliwal, SAnthes, JCPiwinski, JJ Preparation of oxime dual NK(1)/NK(2) antagonists with reduced NK(3) affinity. Bioorg Med Chem Lett12:2355-8 (2002) Substance-K receptor
Name:Substance-K receptor
Type:Protein
Mol. Mass.:44455.78
Organism:Homo sapiens (Human)
Description:P21452
Residue:398
BDBM50116719
NameBDBM50116719
Synonyms:3,5-Dichloro-N-{(R)-3-(3,4-dichloro-phenyl)-2-[(Z)-methoxyimino]-5-[4-(3-methyl-2-oxo-2,3-dihydro-benzoimidazol-1-yl)-piperidin-1-yl]-pentyl}-N-methyl-benzamide | CHEMBL306952
TypeSmall organic molecule
Emp. Form.C33H35Cl4N5O3
Mol. Mass.691.475
SMILESCO\N=C(/CN(C)C(=O)c1cc(Cl)cc(Cl)c1)[C@H](CCN1CCC(CC1)n1c2ccccc2n(C)c1=O)c1ccc(Cl)c(Cl)c1