Reaction Details
TargetAlpha-1A adrenergic receptor
LigandBDBM50116932
Substrate/Competitorn/a
Meas. Tech.ChEBML_33733
Ki 2321±n/a nM
Citation Khatuya, HHutchings, RHKuo, GHPulito, VLJolliffe, LKLi, XMurray, WV Arylpiperazine substituted heterocycles as selective alpha(1a) adrenergic antagonists. Bioorg Med Chem Lett12:2443-6 (2002) Alpha-1A adrenergic receptor
Name:Alpha-1A adrenergic receptor
Type:Cell-surface receptors
Mol. Mass.:51511.67
Organism:Homo sapiens (Human)
Description:P35348
Residue:466
BDBM50116932
NameBDBM50116932
Synonyms:1-{2-[4-(2-Isopropoxy-phenyl)-piperazin-1-ylmethyl]-oxazol-4-ylmethyl}-piperidin-2-one | CHEMBL82480
TypeSmall organic molecule
Emp. Form.C23H32N4O3
Mol. Mass.412.5252
SMILESCC(C)Oc1ccccc1N1CCN(Cc2nc(CN3CCCCC3=O)co2)CC1