Reaction Details
TargetAlpha-1A adrenergic receptor
LigandBDBM50116936
Substrate/Competitorn/a
Meas. Tech.ChEBML_33733
Ki 0.900000±n/a nM
Citation Khatuya, HHutchings, RHKuo, GHPulito, VLJolliffe, LKLi, XMurray, WV Arylpiperazine substituted heterocycles as selective alpha(1a) adrenergic antagonists. Bioorg Med Chem Lett12:2443-6 (2002) Alpha-1A adrenergic receptor
Name:Alpha-1A adrenergic receptor
Type:Cell-surface receptors
Mol. Mass.:51511.67
Organism:Homo sapiens (Human)
Description:P35348
Residue:466
BDBM50116936
NameBDBM50116936
Synonyms:1-{2-[4-(2-Isopropoxy-phenyl)-piperazin-1-ylmethyl]-thiazol-4-ylmethyl}-pyrrolidin-2-one | CHEMBL310768
TypeSmall organic molecule
Emp. Form.C22H30N4O2S
Mol. Mass.414.564
SMILESCC(C)Oc1ccccc1N1CCN(Cc2nc(CN3CCCC3=O)cs2)CC1