Reaction Details
TargetAlpha-1D adrenergic receptor
LigandBDBM50116940
Substrate/Competitorn/a
Meas. Tech.ChEBML_32447
Ki 66±n/a nM
Citation Khatuya, HHutchings, RHKuo, GHPulito, VLJolliffe, LKLi, XMurray, WV Arylpiperazine substituted heterocycles as selective alpha(1a) adrenergic antagonists. Bioorg Med Chem Lett12:2443-6 (2002) Alpha-1D adrenergic receptor
Name:Alpha-1D adrenergic receptor
Type:Enzyme Catalytic Domain
Mol. Mass.:60485.82
Organism:Homo sapiens (Human)
Description:adrenergic Alpha1D ADRA1D HUMAN::P25100
Residue:572
BDBM50116940
NameBDBM50116940
Synonyms:1-{5-[4-(2-Isopropoxy-phenyl)-piperazin-1-ylmethyl]-isoxazol-3-ylmethyl}-pyrrolidin-2-one | CHEMBL309969
TypeSmall organic molecule
Emp. Form.C22H30N4O3
Mol. Mass.398.4986
SMILESCC(C)Oc1ccccc1N1CCN(Cc2cc(CN3CCCC3=O)no2)CC1