Reaction Details
TargetAlpha-1A adrenergic receptor
LigandBDBM50116940
Substrate/Competitorn/a
Meas. Tech.ChEBML_33733
Ki 1.1±n/a nM
Citation Khatuya, HHutchings, RHKuo, GHPulito, VLJolliffe, LKLi, XMurray, WV Arylpiperazine substituted heterocycles as selective alpha(1a) adrenergic antagonists. Bioorg Med Chem Lett12:2443-6 (2002) Alpha-1A adrenergic receptor
Name:Alpha-1A adrenergic receptor
Type:Cell-surface receptors
Mol. Mass.:51511.67
Organism:Homo sapiens (Human)
Description:P35348
Residue:466
BDBM50116940
NameBDBM50116940
Synonyms:1-{5-[4-(2-Isopropoxy-phenyl)-piperazin-1-ylmethyl]-isoxazol-3-ylmethyl}-pyrrolidin-2-one | CHEMBL309969
TypeSmall organic molecule
Emp. Form.C22H30N4O3
Mol. Mass.398.4986
SMILESCC(C)Oc1ccccc1N1CCN(Cc2cc(CN3CCCC3=O)no2)CC1