Reaction Details
TargetRetinoic acid receptor RXR-gamma
LigandBDBM50092055
Substrate/Competitorn/a
Meas. Tech.ChEBML_70528
Ki>6000±n/a nM
Citation Walker, JRAlshafie, GAbou-Issa, HCurley, RW An improved synthesis of the C-linked glucuronide of N-(4-hydroxyphenyl)retinamide. Bioorg Med Chem Lett12:2447-50 (2002) Retinoic acid receptor RXR-gamma
Name:Retinoic acid receptor RXR-gamma
Type:PROTEIN
Mol. Mass.:50878.26
Organism:Homo sapiens (Human)
Description:ChEMBL_197216
Residue:463
BDBM50092055
NameBDBM50092055
Synonyms:(2E,4E,6E,8E)-3,7-Dimethyl-9-(2,6,6-trimethyl-cyclohex-1-enyl)-nona-2,4,6,8-tetraenoic acid (4-hydroxy-phenyl)-amide 3,7-Dimethyl-9-(2,6,6-trimethyl-cyclohex-1-enyl)-nona-2,4,6,8-tetraenoic acid (4-hydroxy-phenyl)-amide CHEMBL7301 N-(4-HYDROXYPHENYL)ALL-TRANS RETINAMIDE N-(4-hydroxyphenyl)retinamide | N-(4-hydroxyphenyl)retinamide, 4-HPR
TypeSmall organic molecule
Emp. Form.C26H33NO2
Mol. Mass.391.5457
SMILESC\C(\C=C\C1=C(C)CCCC1(C)C)=C/C=C/C(/C)=C/C(=O)Nc1ccc(O)cc1