Reaction Details
TargetAdenosine receptor A1
LigandBDBM50117109
Substrate/Competitorn/a
Meas. Tech.ChEMBL_27899 (CHEMBL640559)
Ki 250±n/a nM
Citation Maconi, APastorin, GDa Ros, TSpalluto, GGao, ZGJacobson, KABaraldi, PGCacciari, BVarani, KMoro, SBorea, PA Synthesis, biological properties, and molecular modeling investigation of the first potent, selective, and water-soluble human A(3) adenosine receptor antagonist. J Med Chem45:3579-82 (2002) Adenosine receptor A1
Name:Adenosine receptor A1
Type:G Protein-Coupled Receptor (GPCR)
Mol. Mass.:36520.92
Organism:Homo sapiens (Human)
Description:P30542
Residue:326
BDBM50117109
NameBDBM50117109
Synonyms:1-(2-Furan-2-yl-8-methyl-8H-pyrazolo[4,3-e][1,2,4]triazolo[1,5-c]pyrimidin-5-yl)-3-pyridin-4-yl-urea CHEMBL332091
TypeSmall organic molecule
Emp. Form.C17H13N9O2
Mol. Mass.375.3442
SMILESCn1cc2c(n1)nc(NC(=O)Nc1ccncc1)n1nc(nc21)-c1ccco1