Reaction Details
TargetAdenosine receptor A3
LigandBDBM50117108
Substrate/Competitorn/a
Meas. Tech.ChEMBL_31553 (CHEMBL644504)
IC50 0.7±n/a nM
Citation Maconi, APastorin, GDa Ros, TSpalluto, GGao, ZGJacobson, KABaraldi, PGCacciari, BVarani, KMoro, SBorea, PA Synthesis, biological properties, and molecular modeling investigation of the first potent, selective, and water-soluble human A(3) adenosine receptor antagonist. J Med Chem45:3579-82 (2002) Adenosine receptor A3
Name:Adenosine receptor A3
Type:G Protein-Coupled Receptor (GPCR)
Mol. Mass.:36197.32
Organism:Homo sapiens (Human)
Description:P0DMS8
Residue:318
BDBM50117108
NameBDBM50117108
Synonyms:4-[3-(2-Furan-2-yl-8-methyl-8H-pyrazolo[4,3-e][1,2,4]triazolo[1,5-c]pyrimidin-5-yl)-ureido]-pyridinium; chloride CHEMBL118923
TypeSmall organic molecule
Emp. Form.C17H14N9O2
Mol. Mass.376.3516
SMILESCn1cc2c(n1)nc(NC(=O)Nc1cc[nH+]cc1)n1nc(nc21)-c1ccco1