Reaction Details
Target5-hydroxytryptamine receptor 1A
LigandBDBM50117118
Substrate/Competitorn/a
Meas. Tech.ChEMBL_1316 (CHEMBL616693)
Ki 182±n/a nM
Citation Betti, LBotta, MCorelli, FFloridi, MGiannaccini, GMaccari, LManetti, FStrappaghetti, GTafi, ACorsano, S Alpha(1)-adrenoceptor antagonists. 4. Pharmacophore-based design, synthesis, and biological evaluation of new imidazo-, benzimidazo-, and indoloarylpiperazine derivatives. J Med Chem45:3603-11 (2002) 5-hydroxytryptamine receptor 1A
Name:5-hydroxytryptamine receptor 1A
Type:G Protein-Coupled Receptor (GPCR)
Mol. Mass.:46445.29
Organism:Rattus norvegicus (rat)
Description:Binding assays were performed using rat hippocampal membranes.
Residue:422
BDBM50117118
NameBDBM50117118
Synonyms:6-(1H-benzo[d]imidazol-1-yl)-2-(7-(4-(2-chlorophenyl)piperazin-1-yl)heptyl)pyridazin-3(2H)-one CHEMBL420544
TypeSmall organic molecule
Emp. Form.C28H33ClN6O
Mol. Mass.505.054
SMILESClc1ccccc1N1CCN(CCCCCCCn2nc(ccc2=O)-n2cnc3ccccc23)CC1