Reaction Details
Target5-hydroxytryptamine receptor 1A
LigandBDBM50117129
Substrate/Competitorn/a
Meas. Tech.ChEMBL_1316 (CHEMBL616693)
Ki 141±n/a nM
Citation Betti, LBotta, MCorelli, FFloridi, MGiannaccini, GMaccari, LManetti, FStrappaghetti, GTafi, ACorsano, S Alpha(1)-adrenoceptor antagonists. 4. Pharmacophore-based design, synthesis, and biological evaluation of new imidazo-, benzimidazo-, and indoloarylpiperazine derivatives. J Med Chem45:3603-11 (2002) 5-hydroxytryptamine receptor 1A
Name:5-hydroxytryptamine receptor 1A
Type:G Protein-Coupled Receptor (GPCR)
Mol. Mass.:46445.29
Organism:Rattus norvegicus (rat)
Description:Binding assays were performed using rat hippocampal membranes.
Residue:422
BDBM50117129
NameBDBM50117129
Synonyms:6-(1H-indol-1-yl)-2-(5-(4-(2-methoxyphenyl)piperazin-1-yl)pentyl)pyridazin-3(2H)-one CHEMBL331692
TypeSmall organic molecule
Emp. Form.C28H33N5O2
Mol. Mass.471.5939
SMILESCOc1ccccc1N1CCN(CCCCCn2nc(ccc2=O)-n2ccc3ccccc23)CC1