Reaction Details
TargetCannabinoid receptor 1
LigandBDBM22988
Substrate/Competitorn/a
Meas. Tech.ChEMBL_46465 (CHEMBL657912)
Ki 39.2±n/a nM
Citation Barnett-Norris, JHurst, DPLynch, DLGuarnieri, FMakriyannis, AReggio, PH Conformational memories and the endocannabinoid binding site at the cannabinoid CB1 receptor. J Med Chem45:3649-59 (2002) Cannabinoid receptor 1
Name:Cannabinoid receptor 1
Type:G Protein-Coupled Receptor (GPCR)
Mol. Mass.:52868.96
Organism:Homo sapiens (Human)
Description:P21554
Residue:472
BDBM22988
NameBDBM22988
Synonyms:(5Z,8Z,11Z,14Z)-N-(2-hydroxyethyl)icosa-5,8,11,14-tetraenamide ANANDAMIDE Arachidonoyl ethanolamide (AEA) Arachidonylethanolamide [14C]Anandamide | [3H]Anandamide
Typeradiolabeled substrate
Emp. Form.C22H37NO2
Mol. Mass.347.5347
SMILESCCCCC\C=C/C\C=C/C\C=C/C\C=C/CCCC(=O)NCCO