Reaction Details
TargetAdenosine receptor A3
LigandBDBM50117222
Substrate/Competitorn/a
Meas. Tech.ChEMBL_31413 (CHEMBL644556)
IC50 0.21±n/a nM
Citation Okamura, TKurogi, YNishikawa, HHashimoto, KFujiwara, HNagao, Y 1,2,4-Triazolo[5,1-i]purine derivatives as highly potent and selective human adenosine A(3) receptor ligands. J Med Chem45:3703-8 (2002) Adenosine receptor A3
Name:Adenosine receptor A3
Type:G Protein-Coupled Receptor (GPCR)
Mol. Mass.:36197.32
Organism:Homo sapiens (Human)
Description:P0DMS8
Residue:318
BDBM50117222
NameBDBM50117222
Synonyms:5-Butyl-8-(4-ethoxy-phenyl)-3H-[1,2,4]triazolo[5,1-i]purine | CHEMBL122819
TypeSmall organic molecule
Emp. Form.C18H20N6O
Mol. Mass.336.391
SMILESCCCCc1nc2nc[nH]c2c2nc(nn12)-c1ccc(OCC)cc1