Reaction Details
TargetAdenosine receptor A3
LigandBDBM50117231
Substrate/Competitorn/a
Meas. Tech.ChEMBL_31413 (CHEMBL644556)
IC50 0.25±n/a nM
Citation Okamura, TKurogi, YNishikawa, HHashimoto, KFujiwara, HNagao, Y 1,2,4-Triazolo[5,1-i]purine derivatives as highly potent and selective human adenosine A(3) receptor ligands. J Med Chem45:3703-8 (2002) Adenosine receptor A3
Name:Adenosine receptor A3
Type:G Protein-Coupled Receptor (GPCR)
Mol. Mass.:36197.32
Organism:Homo sapiens (Human)
Description:P0DMS8
Residue:318
BDBM50117231
NameBDBM50117231
Synonyms:5-Butyl-8-(4-fluoro-phenyl)-3H-[1,2,4]triazolo[5,1-i]purine | CHEMBL333415
TypeSmall organic molecule
Emp. Form.C16H15FN6
Mol. Mass.310.3289
SMILESCCCCc1nc2nc[nH]c2c2nc(nn12)-c1ccc(F)cc1