Reaction Details
TargetAdenosine receptor A3
LigandBDBM50117232
Substrate/Competitorn/a
Meas. Tech.ChEMBL_31413 (CHEMBL644556)
IC50 0.25±n/a nM
Citation Okamura, TKurogi, YNishikawa, HHashimoto, KFujiwara, HNagao, Y 1,2,4-Triazolo[5,1-i]purine derivatives as highly potent and selective human adenosine A(3) receptor ligands. J Med Chem45:3703-8 (2002) Adenosine receptor A3
Name:Adenosine receptor A3
Type:G Protein-Coupled Receptor (GPCR)
Mol. Mass.:36197.32
Organism:Homo sapiens (Human)
Description:P0DMS8
Residue:318
BDBM50117232
NameBDBM50117232
Synonyms:5-Butyl-8-phenyl-3H-[1,2,4]triazolo[5,1-i]purine | CHEMBL122512
TypeSmall organic molecule
Emp. Form.C16H16N6
Mol. Mass.292.3384
SMILESCCCCc1nc2nc[nH]c2c2nc(nn12)-c1ccccc1