Reaction Details
TargetAdenosine receptor A3
LigandBDBM50117237
Substrate/Competitorn/a
Meas. Tech.ChEMBL_31413 (CHEMBL644556)
IC50 0.41±n/a nM
Citation Okamura, TKurogi, YNishikawa, HHashimoto, KFujiwara, HNagao, Y 1,2,4-Triazolo[5,1-i]purine derivatives as highly potent and selective human adenosine A(3) receptor ligands. J Med Chem45:3703-8 (2002) Adenosine receptor A3
Name:Adenosine receptor A3
Type:G Protein-Coupled Receptor (GPCR)
Mol. Mass.:36197.32
Organism:Homo sapiens (Human)
Description:P0DMS8
Residue:318
BDBM50117237
NameBDBM50117237
Synonyms:5,8-Diphenyl-3H-[1,2,4]triazolo[5,1-i]purine | CHEMBL330982
TypeSmall organic molecule
Emp. Form.C18H12N6
Mol. Mass.312.3281
SMILESc1nc2c(nc(-c3ccccc3)n3nc(nc23)-c2ccccc2)[nH]1