Reaction Details
TargetAdenosine receptor A3
LigandBDBM50117215
Substrate/Competitorn/a
Meas. Tech.ChEMBL_31414 (CHEMBL883238)
IC50 0.61±n/a nM
Citation Okamura, TKurogi, YNishikawa, HHashimoto, KFujiwara, HNagao, Y 1,2,4-Triazolo[5,1-i]purine derivatives as highly potent and selective human adenosine A(3) receptor ligands. J Med Chem45:3703-8 (2002) Adenosine receptor A3
Name:Adenosine receptor A3
Type:G Protein-Coupled Receptor (GPCR)
Mol. Mass.:36197.32
Organism:Homo sapiens (Human)
Description:P0DMS8
Residue:318
BDBM50117215
NameBDBM50117215
Synonyms:5-Butyl-8-(4-trifluoromethyl-phenyl)-3H-[1,2,4]triazolo[5,1-i]purine | CHEMBL123705
TypeSmall organic molecule
Emp. Form.C17H15F3N6
Mol. Mass.360.3364
SMILESCCCCc1nc2nc[nH]c2c2nc(nn12)-c1ccc(cc1)C(F)(F)F