Reaction Details
TargetAdenosine receptor A3
LigandBDBM50117230
Substrate/Competitorn/a
Meas. Tech.ChEMBL_31413 (CHEMBL644556)
IC50 1±n/a nM
Citation Okamura, TKurogi, YNishikawa, HHashimoto, KFujiwara, HNagao, Y 1,2,4-Triazolo[5,1-i]purine derivatives as highly potent and selective human adenosine A(3) receptor ligands. J Med Chem45:3703-8 (2002) Adenosine receptor A3
Name:Adenosine receptor A3
Type:G Protein-Coupled Receptor (GPCR)
Mol. Mass.:36197.32
Organism:Homo sapiens (Human)
Description:P0DMS8
Residue:318
BDBM50117230
NameBDBM50117230
Synonyms:5-Methyl-8-phenyl-3H-[1,2,4]triazolo[5,1-i]purine | CHEMBL339655
TypeSmall organic molecule
Emp. Form.C13H10N6
Mol. Mass.250.2587
SMILESCc1nc2nc[nH]c2c2nc(nn12)-c1ccccc1