Reaction Details
TargetFatty-acid amide hydrolase 1
LigandBDBM22988
Substrate/Competitorn/a
Meas. Tech.ChEMBL_68777 (CHEMBL686015)
Ki>10000±n/a nM
Citation van der Stelt, Mvan Kuik, JABari, Mvan Zadelhoff, GLeeflang, BRVeldink, GAFinazzi-Agrò, AVliegenthart, JFMaccarrone, M Oxygenated metabolites of anandamide and 2-arachidonoylglycerol: conformational analysis and interaction with cannabinoid receptors, membrane transporter, and fatty acid amide hydrolase. J Med Chem45:3709-20 (2002) Fatty-acid amide hydrolase 1
Name:Fatty-acid amide hydrolase 1
Type:Protein
Mol. Mass.:63071.19
Organism:Homo sapiens (Human)
Description:O00519
Residue:579
BDBM22988
NameBDBM22988
Synonyms:(5Z,8Z,11Z,14Z)-N-(2-hydroxyethyl)icosa-5,8,11,14-tetraenamide ANANDAMIDE Arachidonoyl ethanolamide (AEA) Arachidonylethanolamide [14C]Anandamide | [3H]Anandamide
Typeradiolabeled substrate
Emp. Form.C22H37NO2
Mol. Mass.347.5347
SMILESCCCCC\C=C/C\C=C/C\C=C/C\C=C/CCCC(=O)NCCO