Reaction Details
TargetMitogen-activated protein kinase kinase kinase 20
LigandBDBM50556597
Substrate/Competitorn/a
Meas. Tech.ChEMBL_2056723 (CHEMBL4711724)
IC50 1700±n/a nM
Citation Röhm, SSchröder, MDwyer, JEWiddowson, CSChaikuad, ABerger, BTJoerger, ACKrämer, AHarbig, JDauch, DKudolo, MLaufer, SBagley, MCKnapp, S Selective targeting of the ?C and DFG-out pocket in p38 MAPK. Eur J Med Chem208:0 (2020) 
 
Mitogen-activated protein kinase kinase kinase 20
Name:Mitogen-activated protein kinase kinase kinase 20
Type:PROTEIN
Mol. Mass.:91168.58
Organism:Homo sapiens (Human)
Description:ChEMBL_1495629
Residue:800
BDBM50556597
NameBDBM50556597
Synonyms:CHEMBL4756586
TypeSmall organic molecule
Emp. Form.C30H38N6O3
Mol. Mass.530.6611
SMILESCCNC(=O)[C@H](CCC1CCCCC1)NC(=O)c1ccc(CNC(=O)c2cnn(c2N)-c2ccccc2)cc1