Reaction Details
TargetCarbonic anhydrase 12
LigandBDBM50171206
Substrate/Competitorn/a
Meas. Tech.ChEMBL_2056745 (CHEMBL4711746)
Ki 56±n/a nM
Citation Abdelrahman, MAIbrahim, HSNocentini, AEldehna, WMBonardi, AAbdel-Aziz, HAGratteri, PAbou-Seri, SMSupuran, CT Novel 3-substituted coumarins as selective human carbonic anhydrase IX and XII inhibitors: Synthesis, biological and molecular dynamics analysis. Eur J Med Chem209:0 (2021) 
 
Carbonic anhydrase 12
Name:Carbonic anhydrase 12
Type:Enzyme
Mol. Mass.:39456.00
Organism:Homo sapiens (Human)
Description:Catalytic domain of human cloned isozyme was used in the assay
Residue:354
BDBM50171206
NameBDBM50171206
Synonyms:CHEMBL3805919
TypeSmall organic molecule
Emp. Form.C17H14BrN3O4S
Mol. Mass.436.28
SMILESC\C(=N/Nc1ccc(cc1)S(N)(=O)=O)c1cc2cc(Br)ccc2oc1=O