Reaction Details
TargetSodium-dependent serotonin transporter
LigandBDBM50055003
Substrate/Competitorn/a
Meas. Tech.ChEMBL_201484 (CHEMBL805241)
Ki 39±n/a nM
Citation Houlihan, WJAhmad, UFKoletar, JKelly, LBrand, LKopajtic, TA Benzo- and cyclohexanomazindol analogues as potential inhibitors of the cocaine binding site at the dopamine transporter. J Med Chem45:4110-8 (2002) Sodium-dependent serotonin transporter
Name:Sodium-dependent serotonin transporter
Type:Multi-pass membrane protein
Mol. Mass.:70322.51
Organism:Homo sapiens (Human)
Description:P31645
Residue:630
BDBM50055003
NameBDBM50055003
Synonyms:6-(4-Chloro-phenyl)-2,3,4,6-tetrahydro-pyrimido[2,1-a]isoindol-6-ol CHEMBL130477
TypeSmall organic molecule
Emp. Form.C17H15ClN2O
Mol. Mass.298.767
SMILESOC1(N2CCCN=C2c2ccccc12)c1ccc(Cl)cc1