Reaction Details
TargetSodium-dependent serotonin transporter
LigandBDBM50118338
Substrate/Competitorn/a
Meas. Tech.ChEMBL_201963 (CHEMBL809149)
Ki 3.2±n/a nM
Citation Orús, LPérez-Silanes, SOficialdegui, AMMartínez-Esparza, JDel Castillo, JCMourelle, MLanger, TGuccione, SDonzella, GKrovat, EMPoptodorov, KLasheras, BBallaz, SHervías, ITordera, RDel Río, JMonge, A Synthesis and molecular modeling of new 1-aryl-3-[4-arylpiperazin-1-yl]-1-propane derivatives with high affinity at the serotonin transporter and at 5-HT(1A) receptors. J Med Chem45:4128-39 (2002) Sodium-dependent serotonin transporter
Name:Sodium-dependent serotonin transporter
Type:Multi-pass membrane protein
Mol. Mass.:70168.43
Organism:Rattus norvegicus (rat)
Description:P31652
Residue:630
BDBM50118338
NameBDBM50118338
Synonyms:1-(benzo[b]thiophen-3-yl)-3-(4-(benzo[b]thiophen-5-yl)piperazin-1-yl)propan-1-ol CHEMBL341434
TypeSmall organic molecule
Emp. Form.C23H24N2OS2
Mol. Mass.408.579
SMILESOC(CCN1CCN(CC1)c1ccc2sccc2c1)c1csc2ccccc12