Reaction Details
Target5-hydroxytryptamine receptor 1A
LigandBDBM50118335
Substrate/Competitorn/a
Meas. Tech.ChEMBL_1140 (CHEMBL616085)
Ki 6±n/a nM
Citation Orús, LPérez-Silanes, SOficialdegui, AMMartínez-Esparza, JDel Castillo, JCMourelle, MLanger, TGuccione, SDonzella, GKrovat, EMPoptodorov, KLasheras, BBallaz, SHervías, ITordera, RDel Río, JMonge, A Synthesis and molecular modeling of new 1-aryl-3-[4-arylpiperazin-1-yl]-1-propane derivatives with high affinity at the serotonin transporter and at 5-HT(1A) receptors. J Med Chem45:4128-39 (2002) 5-hydroxytryptamine receptor 1A
Name:5-hydroxytryptamine receptor 1A
Type:G Protein-Coupled Receptor (GPCR)
Mol. Mass.:46445.29
Organism:Rattus norvegicus (rat)
Description:Binding assays were performed using rat hippocampal membranes.
Residue:422
BDBM50118335
NameBDBM50118335
Synonyms:3-(4-(2,3-dihydrobenzo[b][1,4]dioxin-5-yl)piperazin-1-yl)-1-(5-fluorobenzo[b]thiophen-3-yl)propan-1-ol CHEMBL336842
TypeSmall organic molecule
Emp. Form.C23H25FN2O3S
Mol. Mass.428.52
SMILESOC(CCN1CCN(CC1)c1cccc2OCCOc12)c1csc2ccc(F)cc12