Reaction Details
TargetPapain
LigandBDBM50409594
Substrate/Competitorn/a
Meas. Tech.ChEMBL_222141 (CHEMBL822229)
Ki 21±n/a nM
Citation Wieczerzak, EDrabik, PŁankiewicz, LOldziej, SGrzonka, ZAbrahamson, MGrubb, ABrömme, D Azapeptides structurally based upon inhibitory sites of cystatins as potent and selective inhibitors of cysteine proteases. J Med Chem45:4202-11 (2002) Papain
Name:Papain
Type:Enzyme
Mol. Mass.:38923.01
Organism:Carica papaya
Description:Papain was purchased from Sigma, Germany.
Residue:345
BDBM50409594
NameBDBM50409594
Synonyms:CHEMBL2028924
TypeSmall organic molecule
Emp. Form.C24H30N4O5
Mol. Mass.454.5188
SMILESCC(C)[C@H](NC(=O)NNC(=O)[C@H](Cc1ccccc1)NC(C)=O)C(=O)OCc1ccccc1