Reaction Details
TargetRibosyldihydronicotinamide dehydrogenase [quinone]
LigandBDBM50118439
Substrate/Competitorn/a
Meas. Tech.ChEMBL_104940 (CHEMBL714719)
Ki 5490±n/a nM
Citation Fukatsu, KUchikawa, OKawada, MYamano, TYamashita, MKato, KHirai, KHinuma, SMiyamoto, MOhkawa, S Synthesis of a novel series of benzocycloalkene derivatives as melatonin receptor agonists. J Med Chem45:4212-21 (2002) Ribosyldihydronicotinamide dehydrogenase [quinone]
Name:Ribosyldihydronicotinamide dehydrogenase [quinone]
Type:Protein
Mol. Mass.:25917.25
Organism:Homo sapiens (Human)
Description:P16083
Residue:231
BDBM50118439
NameBDBM50118439
Synonyms:CHEMBL134875 | N-[2-(6-Isopropoxy-indan-1-yl)-ethyl]-propionamide
TypeSmall organic molecule
Emp. Form.C17H25NO2
Mol. Mass.275.3859
SMILESCCC(=O)NCCC1CCc2ccc(OC(C)C)cc12