Reaction Details
TargetRibosyldihydronicotinamide dehydrogenase [quinone]
LigandBDBM50118446
Substrate/Competitorn/a
Meas. Tech.ChEMBL_104940 (CHEMBL714719)
Ki 497±n/a nM
Citation Fukatsu, KUchikawa, OKawada, MYamano, TYamashita, MKato, KHirai, KHinuma, SMiyamoto, MOhkawa, S Synthesis of a novel series of benzocycloalkene derivatives as melatonin receptor agonists. J Med Chem45:4212-21 (2002) Ribosyldihydronicotinamide dehydrogenase [quinone]
Name:Ribosyldihydronicotinamide dehydrogenase [quinone]
Type:Protein
Mol. Mass.:25917.25
Organism:Homo sapiens (Human)
Description:P16083
Residue:231
BDBM50118446
NameBDBM50118446
Synonyms:2,2,2-Trifluoro-N-[2-(6-methoxy-indan-1-yl)-ethyl]-acetamide | CHEMBL134295
TypeSmall organic molecule
Emp. Form.C14H16F3NO2
Mol. Mass.287.2775
SMILESCOc1ccc2CCC(CCNC(=O)C(F)(F)F)c2c1